{"text_format":"1","workbook":"xlsx","n_sheets":14,"sheets":["NOTES","Input Sheet","Assumptions","APOD","CashFlows","Sale","After Tax Cost of Purchase","After Tax Cost of Lease","IRR of Differential","IRR~NPV","Discount Rate Crossover Chart","Sales Price to Equalize Costs","Sales Price Crossover Chart","Data Points for Charts"],"not_rendered":{"charts":4,"images":1,"macros":1,"external_links":0,"defined_names":171,"comments":1,"pivot_tables":0},"unopened":[{"sheet":"Discount Rate Crossover Chart","index":10,"reason":"not_a_worksheet"},{"sheet":"Sales Price Crossover Chart","index":12,"reason":"not_a_worksheet"}],"bounds":{"document_bytes":16777216,"sheet_cells":100000,"rows_first":2000,"rows_last":500,"rows_between":2000,"halvings":0,"cell_chars":16384,"cell_head_chars":4096},"cells_cut":0,"cells_raw":0,"read":"whole","date_system":"1900"}

{"sheet":"NOTES","index":0,"n_rows":0,"n_cols":0,"rows_kept":0,"cut":false,"hidden":false,"merged":[]}

{"sheet":"Input Sheet","index":1,"n_rows":33,"n_cols":8,"rows_kept":33,"cut":false,"hidden":false,"merged":[]}
[]
[]
[]
[]
[]
[null,"User Assumptions"]
[null,"1.   Ordinary Income Tax Rate",0]
[null,"2.   Capital Gain Tax Rate",0]
[null,"3.   Cost Recovery Recapture Tax Rate",0]
[null,"4.   After Tax Discount Rate",0]
[null,"Purchase Assumptions"]
[null,"5.   Purchase Price",0]
[null,"6.   Acquisition Costs",0]
[null,"7.   Acquisition Loan Amount",0]
[null,"8.   Interest Rate",0]
[null,"9.   Amortization Period",0]
[null,"10.  Loan Term",0]
[null,"11.  Payments Per Year",12]
[null,"12. Loan Costs (Percent of Loan Amount)",0]
[null,"13. Improvement Allocation ( Percentage)",0]
{"$rows_left_out":14}
{"sheet":"Assumptions","index":2,"n_rows":55,"n_cols":13,"rows_kept":55,"cut":false,"hidden":true,"merged":[]}
["Ordinary Income Tax Bracket",{"$f":"'Input Sheet'!C7","v":0}]
["Capital Gain Max Tax Rate",{"$f":"'Input Sheet'!C8","v":0}]
["Tax Rate on Straight Line Recapture",{"$f":"'Input Sheet'!C9","v":0}]
["Month Placed in Service:",{"$f":"MONTH(In_Service_date)","v":1}]
["    (from CashFlows Sheet)"]
[null,"Year---->",1,2,3,4,5,6,7,8,9,10,11]
["Vacancy Rates     (enter just year 1, or each year)",null,0,{"$f":"Vac_Yr_1","v":0},{"$f":"Vac_Yr_2","v":0},{"$f":"+E7","v":0},{"$f":"+F7","v":0},{"$f":"Vac_Yr_5","v":0},{"$f":"Vac_Yr_6","v":0},{"$f":"+I7","v":0},0,0,0]
["Rent Income Escalators      (enter just year 2, or each year)",null,null,0,{"$f":"+D8","v":0},0,0,0,{"$f":"+H8","v":0},0,0,0,0]
["Other Income Escalator, with vacancy",null,null,0,{"$f":"+D9","v":0},0,0,0,{"$f":"+H9","v":0},0,0,0,0]
["Other Income Escalator, without vacancy",null,null,0,0,0,0,0,{"$f":"+H10","v":0},0,0,0,0]
["Expense Escalators    (enter just year 2, or each year)",null,null,0,0,0,0,0,{"$f":"+H11","v":0},0,0,0,0]
[]
[null,"Alternative 1",null,"Alternative 2",null,"Alternative 3"]
["Cap rate used in Sale",0,null,0,null,0]
["Expenses of Sale",{"$f":"'Input Sheet'!C24","v":0}]
[]
[]
[]
[]
[]
{"$rows_left_out":36}
{"sheet":"APOD","index":3,"n_rows":57,"n_cols":21,"rows_kept":57,"cut":false,"hidden":true,"merged":[[17,12,17,20],[24,1,24,2],[25,1,25,2],[26,1,26,2],[0,2,0,6],[1,2,1,6],[2,2,2,6],[3,2,3,3],[3,4,3,6],[1,9,1,20],[3,8,3,11],[4,8,4,11],[5,8,5,11],[4,12,4,20],[2,12,2,20],[41,12,41,20],[30,12,30,20],[31,12,31,20],[32,12,32,20],[33,12,33,20],[34,12,34,20],[35,12,35,20],[36,12,36,20],[37,12,37,20],[38,12,38,20],[39,12,39,20],[40,12,40,20],[53,12,53,20],[42,12,42,20],[43,12,43,20],[44,12,44,20],[45,12,45,20],[46,12,46,20],[47,12,47,20],[48,12,48,20],[49,12,49,20],[50,12,50,20],[51,12,51,20],[52,12,52,20],[34,1,34,2],[18,12,18,20],[19,12,19,20],[20,12,20,20],[21,12,21,20],[27,1,27,2],[28,1,28,2],[28,12,28,20],[29,12,29,20],[22,12,22,20],[23,12,23,20],[24,12,24,20],[25,12,25,20],[26,12,26,20],[27,12,27,20],[29,1,29,2],[30,1,30,2],[31,1,31,2],[32,1,32,2],[33,1,33,2],[46,1,46,2],[35,1,35,2],[37,1,37,2],[36,1,36,2],[38,1,38,2],[39,1,39,2],[40,1,40,2],[41,1,41,2],[42,1,42,2],[43,1,43,2],[44,1,44,2],[45,1,45,2],[53,1,53,2],[56,1,56,8],[3,12,3,20],[2,8,2,11],[56,12,56,20],[56,10,56,11],[5,2,5,6],[5,12,5,20],[6,12,6,20],[13,4,13,6],[51,1,51,2],[52,1,52,2],[47,1,47,2],[48,1,48,2],[49,1,49,2],[50,1,50,2]]}
[null,"Property Name",null,null,null,null,null," ","   Annual Property Operating Data"]
[null,"Location"]
[null,"Type of Property",null,null,null,null,null,null,"                             Purchase Price",null,null,null,{"$f":"'Input Sheet'!C12","v":0}]
[null,"Size of Property",null,null,"(Sq. Ft./Units)",null,null,null,"                             Plus Acquisition costs",null,null,null,{"$f":"'Input Sheet'!C13","v":0}]
[null,null,null,null,null,null,null,null,"                             Plus Loan Points",null,null,null,{"$f":"IF(+CashFlows!G5,CashFlows!G5,)","v":0}]
[null,"Purpose of analysis",null,null,null,null,null,null,"                             Less Mortgages",null,null,null,{"$f":"Amount_Mtg_1+Amount_Mtg_2","v":0}]
[null,null,null,null,null,null,null,null,"                             Equals Initial Investment",null,null,null,{"$f":"+purchase_price+Acquisition_Costs+Loan_Points-Total_Beginning_Mortgages","v":0}]
[null,"Assessed/Appraised Values"]
[null,"Land",{"$f":"IF(C10=0,0,100-C10)","v":0},null,{"$f":"IF(C9=0,0,C9/C12)","v":0}]
[null,"Improvements",{"$f":"'Input Sheet'!C20*100","v":0},null,{"$f":"IF(C10=0,0,C10/C12)","v":0},null,null,null,null,null,null,null,null,null,null,null,null,null,"Amort",null,"Loan"]
[null,"Personal Property",null,null,{"$f":"IF(C11=0,0,C11/C12)","v":0},null,null,null," ",null,"Balance",null,"Periodic Pmt",null,"Pmts/Yr",null,"Interest",null,"Period",null,"Term"]
[null,"Total",{"$f":"SUM(C9:C11)","v":0},null,{"$f":"SUM(E9:E11)","v":0},null,null,null,"1st",null,{"$f":"Amount_Mtg_1","v":0},null,{"$f":"Per_Pmt_Mtg_1","v":0},null,{"$f":"Pmts_Year_Mtg_1","v":12},null,{"$f":"Rate_Mtg_1","v":0},null,{"$f":"Amort_Period_Mtg_1","v":0},null,{"$f":"Loan_Term_Mtg_1","v":0}]
[null,null,null,null,null,null,null,null,"2nd",null,{"$f":"Amount_Mtg_2","v":0},null,{"$f":"Per_Pmt_Mtg_2","v":0},null,{"$f":"Pmts_Year_Mtg_2","v":12},null,{"$f":"Rate_Mtg_2","v":0},null,{"$f":"Amort_Period_Mtg_2","v":0},null,{"$f":"Loan_Term_Mtg_2","v":0}]
[null,"Adjusted Basis as of:",{"$f":"TODAY()","v":"2016-12-04"},null,{"$f":"+purchase_price + Acquisition_Costs","v":0}]
[null,null,null,null," "]
[null,null,null,null,"$/SQ FT",null,"%"]
[null,"ALL FIGURES ARE ANNUAL",null,null,"or $/Unit",null,"of GOI",null,null,null,null,null,"COMMENTS/FOOTNOTES"]
[1," POTENTIAL RENTAL INCOME",null,null,null,null,null,null,null,null,{"$f":"E18*Size_of_Property","v":0},null," "]
[2," Plus:  Other Income (affected by vacancy)"]
[3," Less: Vacancy & Cr. Losses",null,null,null,"(",{"$f":"+Vac_Yr_1","v":0},"of",{"$f":"PRI_APOD+Other_Inc_with_vac","v":0},")",{"$f":"G20*I20","v":0}]
{"$rows_left_out":38}
{"sheet":"CashFlows","index":4,"n_rows":53,"n_cols":14,"rows_kept":53,"cut":false,"hidden":false,"merged":[[2,2,2,3],[3,2,3,3],[4,2,4,3],[5,2,5,3],[2,6,2,7],[3,6,3,7],[4,6,4,7],[5,6,5,7],[6,6,6,7],[51,0,51,7],[24,1,24,2],[25,1,25,2],[26,1,26,2],[27,1,27,2],[28,1,28,2],[29,1,29,2],[30,1,30,2],[31,1,31,2],[45,1,45,2],[32,1,32,2],[33,1,33,2],[34,1,34,2],[35,1,35,2],[36,1,36,2],[37,1,37,2],[38,1,38,2],[39,1,39,2],[42,1,42,2],[43,1,43,2],[44,1,44,2],[52,0,52,7],[46,1,46,2],[47,1,47,2],[48,1,48,2],[49,1,49,2]]}
[null,null,null,null,"   Cash Flow Analysis Worksheet",null,null,null,"."]
[]
[null,"Property Name",{"$f":"APOD!C1","v":0},null,"       Purchase Price",null,{"$f":"IF(+purchase_price,purchase_price,)","v":0}]
[null,"Prepared For",null,null,"            Plus:   Acquisition Costs",null,{"$f":"IF(Acquisition_Costs,Acquisition_Costs,)","v":0}]
[null,"Prepared By",{"$f":"Prepared_by","v":0},null,"            Plus:   Loan Points",null,{"$f":"+Points_Mtg_1+Points_Mtg_2","v":0}]
[null,"Date Prepared",{"$f":"TODAY()","v":"2016-12-04"},null,"            Less:  Mortgages",null,{"$f":"+Amount_Mtg_1+Amount_Mtg_2","v":0}]
[null,null,null,null,"        Equals Initial Investment",null,{"$f":"+G3+G4+G5-G6","v":0}]
[]
[null,null,"Mortgage Data",null,null,"Cost Recovery Data"]
[null,null,"1st Mortgage","2nd Mortgage",null,"Improvements","Personal Property"]
[]
[null,"Amount",{"$f":"'Input Sheet'!C14","v":0},null,"  Value",{"$f":"Adjusted_Basis*Percent_Improvements","v":0}]
[null,"Interest Rate",{"$f":"'Input Sheet'!C15","v":0},null,"  C. R. Method","SL"]
[null,"Amortization Period",{"$f":"'Input Sheet'!C16","v":0},null,"  Useful Life",{"$f":"'Input Sheet'!C21","v":39}]
[null,"Loan Term",{"$f":"'Input Sheet'!C17","v":0},{"$f":"IF(Amort_Period_Mtg_2,Amort_Period_Mtg_2,)","v":0},"  In Service Date","2000-01-01"]
[null,"Payments/Year",{"$f":"'Input Sheet'!C18","v":12},12,"  Date of Sale",{"$f":"+In_Service_date+(365*10)","v":"2009-12-29"}]
[null,"Periodic Payment",{"$f":"IF(C12<1,0,+C12/((1-((1+(C13/C16))^(-(C14*C16))))/(C13/C16)))","v":0},{"$f":"IF(D12<1,0,+D12/((1-((1+(D13/D16))^(-(D14*D16))))/(D13/D16)))","v":0},"  Recapture"]
[null,"Annual Debt Service",{"$f":"C16*C17","v":0},{"$f":"D16*D17","v":0},"  Investment Tax "]
[null,"Points",{"$f":"'Input Sheet'!C14*'Input Sheet'!C19","v":0},null,"  Credit   ($$ or %)"]
[]
{"$rows_left_out":34}
{"sheet":"Sale","index":5,"n_rows":57,"n_cols":25,"rows_kept":57,"cut":false,"hidden":false,"merged":[]}
[null,null,"         Alternative Cash Sales Worksheet"]
[]
[null,null,null,"Mortgage Balances"]
[null,"Year:",1,{"$f":"+C4+1","v":2},{"$f":"+D4+1","v":3},{"$f":"+E4+1","v":4},{"$f":"+F4+1","v":5}]
[null,"Principal Balance - 1st Mortgage",{"$f":"FV(CashFlows!C13/CashFlows!C16,Assumptions!D55,CashFlows!C17,-CashFlows!C12)","v":0},{"$f":"FV(CashFlows!$C$13/CashFlows!$C$16,CashFlows!$C$16,CashFlows!$C$17,-C5,0)*(Loan_Term_Mtg_1>1)","v":0},{"$f":"FV(CashFlows!$C$13/CashFlows!$C$16,CashFlows!$C$16,CashFlows!$C$17,-D5,0)*(Loan_Term_Mtg_1>2)","v":0},{"$f":"FV(CashFlows!$C$13/CashFlows!$C$16,CashFlows!$C$16,CashFlows!$C$17,-E5,0)*(Loan_Term_Mtg_1>3)","v":0},{"$f":"FV(CashFlows!$C$13/CashFlows!$C$16,CashFlows!$C$16,CashFlows!$C$17,-F5,0)*(Loan_Term_Mtg_1>4)","v":0}]
[null,"Principal Balance - 2nd Mortgage",{"$f":"FV(CashFlows!D13/CashFlows!D16,Assumptions!E55,CashFlows!D17,-CashFlows!D12)","v":0},{"$f":"FV(CashFlows!$D$13/CashFlows!$D$16,CashFlows!$D$16,CashFlows!$D$17,-C6,0)*(Loan_Term_Mtg_2>1)","v":0},{"$f":"FV(CashFlows!$D$13/CashFlows!$D$16,CashFlows!$D$16,CashFlows!$D$17,-D6,0)*(Loan_Term_Mtg_2>2)","v":0},{"$f":"FV(CashFlows!$D$13/CashFlows!$D$16,CashFlows!$D$16,CashFlows!$D$17,-E6,0)*(Loan_Term_Mtg_2>3)","v":0},{"$f":"FV(CashFlows!$D$13/CashFlows!$D$16,CashFlows!$D$16,CashFlows!$D$17,-F6,0)*(Loan_Term_Mtg_2>4)","v":0}]
[null,"TOTAL UNPAID BALANCE",{"$f":"+C5+C6","v":0},{"$f":"+D5+D6","v":0},{"$f":"+E5+E6","v":0},{"$f":"+F5+F6","v":0},{"$f":"+G5+G6","v":0}]
[]
[null,"Year:",{"$f":"+G4+1","v":6},{"$f":"+C9+1","v":7},{"$f":"+D9+1","v":8},{"$f":"+E9+1","v":9},{"$f":"+F9+1","v":10}]
[null,"Principal Balance - 1st Mortgage",{"$f":"FV(CashFlows!$C$13/CashFlows!$C$16,CashFlows!$C$16,CashFlows!$C$17,-G5,0)*(Loan_Term_Mtg_1>4)","v":0},{"$f":"FV(CashFlows!$C$13/CashFlows!$C$16,CashFlows!$C$16,CashFlows!$C$17,-C10,0)*(Loan_Term_Mtg_1>4)","v":0},{"$f":"FV(CashFlows!$C$13/CashFlows!$C$16,CashFlows!$C$16,CashFlows!$C$17,-D10,0)*(Loan_Term_Mtg_1>4)","v":0},{"$f":"FV(CashFlows!$C$13/CashFlows!$C$16,CashFlows!$C$16,CashFlows!$C$17,-E10,0)*(Loan_Term_Mtg_1>4)","v":0},{"$f":"FV(CashFlows!$C$13/CashFlows!$C$16,CashFlows!$C$16,CashFlows!$C$17,-F10,0)*(Loan_Term_Mtg_1>4)","v":0}]
[null,"Principal Balance - 2nd Mortgage",{"$f":"FV(CashFlows!$D$13/CashFlows!$D$16,CashFlows!$D$16,CashFlows!$D$17,-G6,0)*(Loan_Term_Mtg_2>4)","v":0},{"$f":"FV(CashFlows!$D$13/CashFlows!$D$16,CashFlows!$D$16,CashFlows!$D$17,-C11,0)*(Loan_Term_Mtg_2>4)","v":0},{"$f":"FV(CashFlows!$D$13/CashFlows!$D$16,CashFlows!$D$16,CashFlows!$D$17,-D11,0)*(Loan_Term_Mtg_2>4)","v":0},{"$f":"FV(CashFlows!$D$13/CashFlows!$D$16,CashFlows!$D$16,CashFlows!$D$17,-E11,0)*(Loan_Term_Mtg_2>4)","v":0},{"$f":"FV(CashFlows!$D$13/CashFlows!$D$16,CashFlows!$D$16,CashFlows!$D$17,-F11,0)*(Loan_Term_Mtg_2>4)","v":0}]
[null,"TOTAL UNPAID BALANCE",{"$f":"+C10+C11","v":0},{"$f":"+D10+D11","v":0},{"$f":"+E10+E11","v":0},{"$f":"+F10+F11","v":0},{"$f":"+G10+G11","v":0}]
[]
[null,null,null,"Calculation of Sale Proceeds"]
[null,null,null,null,1,null,2,null,3,null,4,null,5,null,6,null,7,null,8,null,9,null,10,null,11]
[null,"PROJECTED SALES PRICE",{"$f":"'Input Sheet'!C23","v":0},null,{"$f":"'Data Points for Charts'!B6","v":0},null,{"$f":"'Data Points for Charts'!B7","v":0},null,{"$f":"'Data Points for Charts'!B8","v":0},null,{"$f":"'Data Points for Charts'!B9","v":0},null,{"$f":"'Data Points for Charts'!B10","v":0},null,{"$f":"'Data Points for Charts'!B11","v":0},null,{"$f":"'Data Points for Charts'!B12","v":0},null,{"$f":"'Data Points for Charts'!B13","v":0},null,{"$f":"'Data Points for Charts'!B14","v":0},null,{"$f":"'Data Points for Charts'!B15","v":0},null,{"$f":"'Data Points for Charts'!B16","v":0}]
[null,null,{"$f":"\"(At \"&TEXT(Cap_rate_used_in_Sale_1,\"#.##%\")&\" cap)\"","v":"(At .% cap)"},null,{"$f":"\"(At \"&TEXT(Cap_rate_used_in_Sale_2,\"#.##%\")&\" cap)\"","v":"(At .% cap)"},null,{"$f":"\"(At \"&TEXT(Cap_rate_used_in_Sale_2,\"#.##%\")&\" cap)\"","v":"(At .% cap)"},null,{"$f":"\"(At \"&TEXT(Cap_rate_used_in_Sale_2,\"#.##%\")&\" cap)\"","v":"(At .% cap)"},null,{"$f":"\"(At \"&TEXT(Cap_rate_used_in_Sale_2,\"#.##%\")&\" cap)\"","v":"(At .% cap)"},null,{"$f":"'Data Points for Charts'!B10","v":0},null,{"$f":"\"(At \"&TEXT(Cap_rate_used_in_Sale_2,\"#.##%\")&\" cap)\"","v":"(At .% cap)"},null,{"$f":"\"(At \"&TEXT(Cap_rate_used_in_Sale_2,\"#.##%\")&\" cap)\"","v":"(At .% cap)"},null,{"$f":"\"(At \"&TEXT(Cap_rate_used_in_Sale_2,\"#.##%\")&\" cap)\"","v":"(At .% cap)"},null,{"$f":"\"(At \"&TEXT(Cap_rate_used_in_Sale_2,\"#.##%\")&\" cap)\"","v":"(At .% cap)"},null,{"$f":"\"(At \"&TEXT(Cap_rate_used_in_Sale_2,\"#.##%\")&\" cap)\"","v":"(At .% cap)"},null,{"$f":"\"(At \"&TEXT(Cap_rate_used_in_Sale_2,\"#.##%\")&\" cap)\"","v":"(At .% cap)"}]
[]
[null,"CALCULATION OF ADJUSTED BASIS:"]
[null,"1       Basis at Acquisition",{"$f":"+Adjusted_Basis","v":0},null,{"$f":"+Adjusted_Basis","v":0},null,{"$f":"+Adjusted_Basis","v":0},null,{"$f":"+Adjusted_Basis","v":0},null,{"$f":"+Adjusted_Basis","v":0},null,{"$f":"+Adjusted_Basis","v":0},null,{"$f":"+Adjusted_Basis","v":0},null,{"$f":"+Adjusted_Basis","v":0},null,{"$f":"+Adjusted_Basis","v":0},null,{"$f":"+Adjusted_Basis","v":0},null,{"$f":"+Adjusted_Basis","v":0},null,{"$f":"+Adjusted_Basis","v":0}]
{"$rows_left_out":38}
{"sheet":"After Tax Cost of Purchase","index":6,"n_rows":39,"n_cols":7,"rows_kept":39,"cut":false,"hidden":false,"merged":[]}
[12]
[]
[]
[]
[]
[]
[]
[]
[]
[]
[]
[]
[]
[]
[]
[]
[]
[]
[]
[]
{"$rows_left_out":20}
{"sheet":"After Tax Cost of Lease","index":7,"n_rows":43,"n_cols":8,"rows_kept":43,"cut":false,"hidden":false,"merged":[]}
[]
[]
[]
[]
[]
[]
[]
[]
[]
[]
[]
[]
[]
[]
[]
[]
[]
[]
[]
[]
{"$rows_left_out":24}
{"sheet":"IRR of Differential","index":8,"n_rows":73,"n_cols":9,"rows_kept":73,"cut":false,"hidden":false,"merged":[]}
[]
[]
[]
[]
[]
[]
[]
[]
[]
[]
[]
[]
[]
[]
[]
[]
[]
[]
[]
[]
{"$rows_left_out":54}
{"sheet":"IRR~NPV","index":9,"n_rows":198,"n_cols":12,"rows_kept":198,"cut":false,"hidden":true,"merged":[[66,0,66,11],[67,0,67,11]]}
[]
[null,null,null,null,null,"BEFORE TAX"]
["N",null,"Alternative 1",null,null,"Alternative 2",null,null,"Alternative 3",null,null,"I"]
["R",null,"n","$",null,"n","$",null,"n","$",null,"N"]
["U",null,"0",{"$f":"-Initial_Investment","v":0}," ","0",{"$f":"-Initial_Investment","v":0},null,"0",{"$f":"-Initial_Investment","v":0},null,"T"]
["T",null,"1",{"$f":"CFBT_1","v":0},null,"1",{"$f":"CFBT_1","v":0},null,"1",{"$f":"CFBT_1","v":0},null,"E"]
["E",null,"2",{"$f":"CFBT_2","v":0},null,"2",{"$f":"CFBT_2","v":0},null,"2",{"$f":"CFBT_2","v":0},null,"R"]
["R",null,"3",{"$f":"CFBT_3","v":0},null,"3",{"$f":"CFBT_3","v":0},null,"3",{"$f":"CFBT_3","v":0},null,"N"]
[null,null,"4",{"$f":"CFBT_4","v":0},null,"4",{"$f":"CFBT_4","v":0},null,"4",{"$f":"CFBT_4","v":0},null,"A"]
[null,null,"5",{"$f":"CFBT_5","v":0},null,"5",{"$f":"CFBT_5","v":0},null,"5",{"$f":"CFBT_5","v":0},null,"L"]
[null,null,"6",{"$f":"CFBT_6","v":0},null,"6",{"$f":"CFBT_6","v":0},null,"6",{"$f":"CFBT_6","v":0}]
["F",null,"7",{"$f":"CFBT_7","v":0},null,"7",{"$f":"CFBT_7","v":0},null,"7",{"$f":"CFBT_7","v":0}]
["O",null,"8",{"$f":"CFBT_8","v":0},null,"8",{"$f":"CFBT_8","v":0},null,"8",{"$f":"CFBT_8","v":0},null,"R"]
[null,null,"9",{"$f":"CFBT_9","v":0},null,"9",{"$f":"CFBT_9","v":0},null,"9",{"$f":"CFBT_9","v":0},null,"A"]
[null,null,10,{"$f":"IF(CFBT_10<0,TEXT(-CFBT_10,\"(#,###)\"),TEXT(CFBT_10,\"#,###\"))&\" + \"&IF(Sale!C49<0,TEXT(-Sale!C49,\"(#,###)\"),TEXT(Sale!C49,\"#,###\"))","v":" + "},null,10,{"$f":"IF(CFBT_10<0,TEXT(-CFBT_10,\"(#,###)\"),TEXT(CFBT_10,\"#,###\"))&\" + \"&IF(Sale!E49<0,TEXT(-Sale!E49,\"(#,###)\"),TEXT(Sale!E49,\"#,###\"))","v":" + "},null,10,{"$f":"IF(CFBT_10<0,TEXT(-CFBT_10,\"(#,###)\"),TEXT(CFBT_10,\"#,###\"))&\" + \"&IF(Sale!G49<0,TEXT(-Sale!G49,\"(#,###)\"),TEXT(Sale!G49,\"#,###\"))","v":" + "},null,"T"]
[null,null,"IRR=",{"$f":"IF(SUM(D170:D180)<0,\"  Negative!\",IF(ISERROR(D181),\" Zero\",D181))","v":" Zero"},null,"IRR=",{"$f":"IF(SUM(G170:G180)<0,\"  Negative!\",IF(ISERROR(G181),\" Zero\",G181))","v":" Zero"},null,"IRR=",{"$f":"IF(SUM(J170:J180)<0,\"  Negative!\",IF(ISERROR(J181),\" Zero\",J181))","v":" Zero"},null,"E"]
["S",null,"NPV=",{"$f":"NPV(D18,D171:D180)+D170+0.00001","v":1.0000000000000001E-5},null,"NPV=",{"$f":"NPV(G18,G171:G180)+G170+0.00001","v":1.0000000000000001E-5},null,"NPV=",{"$f":"NPV(J18,J171:J180)+J170+0.00001","v":1.0000000000000001E-5},null,"S"]
["E",null,"@",{"$f":"IF(ISERROR(D181),0.000000000000000001,D181)","v":1.0000000000000001E-18},null,"@",{"$f":"IF(ISERROR(G181),0.000000000000000001,G181)","v":1.0000000000000001E-18},null,"@",{"$f":"IF(ISERROR(J181),0.000000000000000001,J181)","v":1.0000000000000001E-18}]
["T"]
["A"]
{"$rows_left_out":179}
{"sheet":"Sales Price to Equalize Costs","index":11,"n_rows":50,"n_cols":12,"rows_kept":50,"cut":false,"hidden":false,"merged":[]}
[]
[]
[]
[]
[]
[]
[]
[]
[]
[]
[]
[]
[]
[]
[]
[]
[]
[]
[]
[]
{"$rows_left_out":31}
{"sheet":"Data Points for Charts","index":13,"n_rows":46,"n_cols":8,"rows_kept":46,"cut":false,"hidden":true,"merged":[]}
[]
[null,"Sales Price Range","From",{"$f":"'Input Sheet'!C25","v":0},"To",{"$f":"'Input Sheet'!E25","v":0},"In 10 Increments of",{"$f":"(F2-D2)/10","v":0}]
[]
[]
[null,null,"OWN PV"]
[1,{"$f":"D2","v":0},{"$f":"-(NPV($C$18,$F$7:$F$15,H17)+$F$6)","v":0},null,0,{"$f":"'After Tax Cost of Purchase'!C24","v":0}]
[2,{"$f":"B6+$H$2","v":0},{"$f":"-(NPV($C$18,$F$7:$F$15,H18)+$F$6)","v":0},null,1,{"$f":"'After Tax Cost of Purchase'!C25","v":0}]
[3,{"$f":"B7+$H$2","v":0},{"$f":"-(NPV($C$18,$F$7:$F$15,H19)+$F$6)","v":0},null,2,{"$f":"'After Tax Cost of Purchase'!C26","v":0}]
[4,0,0,null,3,{"$f":"'After Tax Cost of Purchase'!C27","v":0}]
[5,0,0,null,4,{"$f":"'After Tax Cost of Purchase'!C28","v":0}]
[6,0,0,null,5,{"$f":"'After Tax Cost of Purchase'!C29","v":0}]
[7,0,0,null,6,{"$f":"'After Tax Cost of Purchase'!C30","v":0}]
[8,0,0,null,7,{"$f":"'After Tax Cost of Purchase'!C31","v":0}]
[9,0,0,null,8,{"$f":"'After Tax Cost of Purchase'!C32","v":0}]
[10,0,0,null,9,{"$f":"'After Tax Cost of Purchase'!C33","v":0}]
[11,0,0,null,10,{"$f":"'After Tax Cost of Purchase'!C34","v":0},"+",0]
[null,null,null,null,null,1,{"$f":"B6","v":0},{"$f":"$F$16+SPAT_2","v":0}]
[null,"Discount Rate",{"$f":"'Input Sheet'!C10","v":0},null,null,2,{"$f":"B7","v":0},{"$f":"$F$16+SPAT_3","v":0}]
[null,null,null,null,null,3,{"$f":"B8","v":0},{"$f":"$F$16+Sale!I53","v":0}]
[null,null,null,null,null,4,0,{"$f":"$F$16+Sale!K53","v":0}]
{"$rows_left_out":26}